Reaction Details
TargetBeta-secretase 1
LigandBDBM50299242
Substrate/Competitorn/a
Meas. Tech.ChEMBL_589296 (CHEMBL1045676)
Ki 309±n/a nM
Citation Al-Tel, THAl-Qawasmeh, RASchmidt, MFAl-Aboudi, ARao, SNSabri, SSVoelter, W Rational design and synthesis of potent dibenzazepine motifs as beta-secretase inhibitors. J Med Chem52:6484-8 (2009) 
 
Beta-secretase 1
Name:Beta-secretase 1
Type:Protein
Mol. Mass.:55755.10
Organism:Homo sapiens (Human)
Description:P56817
Residue:501
BDBM50299242
NameBDBM50299242
Synonyms:3-(3H-Imidazo[4,5-c]pyridin-2-yl)-5H-dibenzo[b,e][1,4]diazepin-11(10H)-one | CHEMBL575326
TypeSmall organic molecule
Emp. Form.C20H14N6O2
Mol. Mass.370.3642
SMILESO=C(Nc1nc2ccncc2[nH]1)c1ccc2c(Nc3ccccc3NC2=O)c1