Reaction Details
TargetRetinoic acid receptor RXR-alpha
LigandBDBM50299279
Substrate/Competitorn/a
Meas. Tech.ChEMBL_589774 (CHEMBL1061278)
Ki 81±n/a nM
Citation Wagner, CEJurutka, PWMarshall, PAGroy, TLvan der Vaart, AZiller, JWFurmick, JKGraeber, MEMatro, EMiguel, BVTran, ITKwon, JTedeschi, JNMoosavi, SDanishyar, APhilp, JSKhamees, ROJackson, JNGrupe, DKBadshah, SLHart, JW Modeling, synthesis and biological evaluation of potential retinoid X receptor (RXR) selective agonists: novel analogues of 4-[1-(3,5,5,8,8-pentamethyl-5,6,7,8-tetrahydro-2-naphthyl)ethynyl]benzoic acid (bexarotene). J Med Chem52:5950-66 (2009) 
 
Retinoic acid receptor RXR-alpha
Name:Retinoic acid receptor RXR-alpha
Type:PROTEIN
Mol. Mass.:50820.38
Organism:Homo sapiens (Human)
Description:ChEMBL_1456363
Residue:462
BDBM50299279
NameBDBM50299279
Synonyms:4-(1-(1,2,3,4-Tetrahydro-1,1,4,4,6-pentamethylnaphthalen-7-yl)vinyl)-2-nitrobenzoic Acid | CHEMBL583410
TypeSmall organic molecule
Emp. Form.C23H27NO4
Mol. Mass.381.4648
SMILESCc1cc2c(cc1Cc1ccc(C(O)=O)c(c1)[N+]([O-])=O)C(C)(C)CCC2(C)C