Reaction Details
TargetRho-associated protein kinase 1
LigandBDBM50299376
Substrate/Competitorn/a
Meas. Tech.ChEMBL_590312 (CHEMBL1054435)
IC50 118±n/a nM
Citation Ho, KKBeasley, JRBelanger, LBlack, DChan, JHDunn, DHu, BKlon, AKultgen, SGOhlmeyer, MParlato, SMRay, PCPham, QRong, YRoughton, ALWalker, TLWright, JXu, KXu, YZhang, LWebb, M Triazine and pyrimidine based ROCK inhibitors with efficacy in spontaneous hypertensive rat model. Bioorg Med Chem Lett19:6027-31 (2009) 
 
Rho-associated protein kinase 1
Name:Rho-associated protein kinase 1
Type:Serine/threonine-protein kinase
Mol. Mass.:158156.77
Organism:Homo sapiens (Human)
Description:Q13464
Residue:1354
BDBM50299376
NameBDBM50299376
Synonyms:(R)-N2-(2,3-dihydro-1H-inden-2-yl)-6-(2-methylpiperazin-1-yl)-N4-(pyridin-4-yl)-1,3,5-triazine-2,4-diamine | CHEMBL575765
TypeSmall organic molecule
Emp. Form.C22H26N8
Mol. Mass.402.4954
SMILESC[C@@H]1CNCCN1c1nc(NC2Cc3ccccc3C2)nc(Nc2ccncc2)n1