Reaction Details
TargetDelta-type opioid receptor
LigandBDBM50299392
Substrate/Competitorn/a
Meas. Tech.ChEMBL_590499 (CHEMBL1058546)
Ki 19±n/a nM
Citation Griffin, AMBrown, WWalpole, CCoupal, MAdam, LGosselin, MSalois, DMorin, PERoumi, M Delta agonist hydroxy bioisosteres: the discovery of 3-((1-benzylpiperidin-4-yl){4-[(diethylamino)carbonyl]phenyl}amino)benzamide with improved delta agonist activity and in vitro metabolic stability. Bioorg Med Chem Lett19:5999-6003 (2009) 
 
Delta-type opioid receptor
Name:Delta-type opioid receptor
Type:G Protein-Coupled Receptor (GPCR)
Mol. Mass.:40382.98
Organism:Homo sapiens (Human)
Description:Competition binding assays were carried out using membrane preparations from transfected HN9.10 cells that constitutively expressed the delta opioid receptor.
Residue:372
BDBM50299392
NameBDBM50299392
Synonyms:4-((1-benzylpiperidin-4-yl)(3-(methylcarbamoyl)phenyl)amino)-N,N-diethylbenzamide | CHEMBL573739
TypeSmall organic molecule
Emp. Form.C31H38N4O2
Mol. Mass.498.659
SMILESCCN(CC)C(=O)c1ccc(cc1)N(C1CCN(Cc2ccccc2)CC1)c1cccc(c1)C(=O)NC