Reaction Details
TargetDelta-type opioid receptor
LigandBDBM50299391
Substrate/Competitorn/a
Meas. Tech.ChEMBL_590504 (CHEMBL1058551)
EC50 19±n/a nM
Citation Griffin, AMBrown, WWalpole, CCoupal, MAdam, LGosselin, MSalois, DMorin, PERoumi, M Delta agonist hydroxy bioisosteres: the discovery of 3-((1-benzylpiperidin-4-yl){4-[(diethylamino)carbonyl]phenyl}amino)benzamide with improved delta agonist activity and in vitro metabolic stability. Bioorg Med Chem Lett19:5999-6003 (2009) 
 
Delta-type opioid receptor
Name:Delta-type opioid receptor
Type:G Protein-Coupled Receptor (GPCR)
Mol. Mass.:40382.98
Organism:Homo sapiens (Human)
Description:Competition binding assays were carried out using membrane preparations from transfected HN9.10 cells that constitutively expressed the delta opioid receptor.
Residue:372
BDBM50299391
NameBDBM50299391
Synonyms:4-((3-aminophenyl)(1-benzylpiperidin-4-yl)amino)-N,N-diethylbenzamide | CHEMBL573757
TypeSmall organic molecule
Emp. Form.C29H36N4O
Mol. Mass.456.6223
SMILESCCN(CC)C(=O)c1ccc(cc1)N(C1CCN(Cc2ccccc2)CC1)c1cccc(N)c1