Reaction Details
TargetMu-type opioid receptor
LigandBDBM50299387
Substrate/Competitorn/a
Meas. Tech.ChEMBL_590500 (CHEMBL1058547)
Ki 5036±n/a nM
Citation Griffin, AMBrown, WWalpole, CCoupal, MAdam, LGosselin, MSalois, DMorin, PERoumi, M Delta agonist hydroxy bioisosteres: the discovery of 3-((1-benzylpiperidin-4-yl){4-[(diethylamino)carbonyl]phenyl}amino)benzamide with improved delta agonist activity and in vitro metabolic stability. Bioorg Med Chem Lett19:5999-6003 (2009) 
 
Mu-type opioid receptor
Name:Mu-type opioid receptor
Type:G Protein-Coupled Receptor (GPCR)
Mol. Mass.:44789.51
Organism:Homo sapiens (Human)
Description:P35372
Residue:400
BDBM50299387
NameBDBM50299387
Synonyms:4-((1-benzylpiperidin-4-yl)(2-carbamoylphenyl)amino)-N,N-diethylbenzamide | CHEMBL573517
TypeSmall organic molecule
Emp. Form.C30H36N4O2
Mol. Mass.484.6324
SMILESCCN(CC)C(=O)c1ccc(cc1)N(C1CCN(Cc2ccccc2)CC1)c1ccccc1C(N)=O