Reaction Details
TargetMu-type opioid receptor
LigandBDBM50299382
Substrate/Competitorn/a
Meas. Tech.ChEMBL_590500 (CHEMBL1058547)
Ki 1541±n/a nM
Citation Griffin, AMBrown, WWalpole, CCoupal, MAdam, LGosselin, MSalois, DMorin, PERoumi, M Delta agonist hydroxy bioisosteres: the discovery of 3-((1-benzylpiperidin-4-yl){4-[(diethylamino)carbonyl]phenyl}amino)benzamide with improved delta agonist activity and in vitro metabolic stability. Bioorg Med Chem Lett19:5999-6003 (2009) 
 
Mu-type opioid receptor
Name:Mu-type opioid receptor
Type:G Protein-Coupled Receptor (GPCR)
Mol. Mass.:44789.51
Organism:Homo sapiens (Human)
Description:P35372
Residue:400
BDBM50299382
NameBDBM50299382
Synonyms:4-((3-acetylphenyl)(1-benzylpiperidin-4-yl)amino)-N,N-diethylbenzamide | CHEMBL576740
TypeSmall organic molecule
Emp. Form.C31H37N3O2
Mol. Mass.483.6444
SMILESCCN(CC)C(=O)c1ccc(cc1)N(C1CCN(Cc2ccccc2)CC1)c1cccc(c1)C(C)=O