Reaction Details
TargetKappa-type opioid receptor
LigandBDBM50299394
Substrate/Competitorn/a
Meas. Tech.ChEMBL_590501 (CHEMBL1058548)
Ki 5543±n/a nM
Citation Griffin, AMBrown, WWalpole, CCoupal, MAdam, LGosselin, MSalois, DMorin, PERoumi, M Delta agonist hydroxy bioisosteres: the discovery of 3-((1-benzylpiperidin-4-yl){4-[(diethylamino)carbonyl]phenyl}amino)benzamide with improved delta agonist activity and in vitro metabolic stability. Bioorg Med Chem Lett19:5999-6003 (2009) 
 
Kappa-type opioid receptor
Name:Kappa-type opioid receptor
Type:G Protein-Coupled Receptor (GPCR)
Mol. Mass.:42648.76
Organism:Homo sapiens (Human)
Description:P41145
Residue:380
BDBM50299394
NameBDBM50299394
Synonyms:CHEMBL575926 | Methyl 3-((1-benzylpiperidin-4-yl)(4-(diethylcarbamoyl)phenyl)amino)benzoate
TypeSmall organic molecule
Emp. Form.C31H37N3O3
Mol. Mass.499.6438
SMILESCCN(CC)C(=O)c1ccc(cc1)N(C1CCN(Cc2ccccc2)CC1)c1cccc(c1)C(=O)OC