Reaction Details
TargetCytochrome P450 2C19
LigandBDBM19188
Substrate/Competitorn/a
Meas. Tech.ChEMBL_590747 (CHEMBL1049147)
IC50 5000±n/a nM
Citation Pisani, LMuncipinto, GMiscioscia, TFNicolotti, OLeonetti, FCatto, MCaccia, CSalvati, PSoto-Otero, RMendez-Alvarez, EPasseleu, CCarotti, A Discovery of a novel class of potent coumarin monoamine oxidase B inhibitors: development and biopharmacological profiling of 7-[(3-chlorobenzyl)oxy]-4-[(methylamino)methyl]-2H-chromen-2-one methanesulfonate (NW-1772) as a highly potent, selective, reversible, and orally active monoamine oxidase B  J Med Chem52:6685-706 (2009) 
 
Cytochrome P450 2C19
Name:Cytochrome P450 2C19
Type:Enzyme
Mol. Mass.:55935.47
Organism:Homo sapiens (Human)
Description:P33261
Residue:490
BDBM19188
NameBDBM19188
Synonyms:7-(3-chlorobenzyloxy)-4-(methylamino)methyl-coumarin, 2 C18 | CHEMBL593763
TypeSmall organic molecule
Emp. Form.C18H16ClNO3
Mol. Mass.329.778
SMILESCNCc1cc(=O)oc2cc(OCc3cccc(Cl)c3)ccc12