Reaction Details
TargetReceptor-type tyrosine-protein phosphatase beta
LigandBDBM50118789
Substrate/Competitorn/a
Meas. Tech.ChEMBL_590758 (CHEMBL1050900)
Ki 33000±n/a nM
Citation Vidovic, DSchürer, SC Knowledge-based characterization of similarity relationships in the human protein-tyrosine phosphatase family for rational inhibitor design. J Med Chem52:6649-59 (2009) 
 
Receptor-type tyrosine-protein phosphatase beta
Name:Receptor-type tyrosine-protein phosphatase beta
Type:Protein
Mol. Mass.:224324.80
Organism:Homo sapiens (Human)
Description:P23467
Residue:1997
BDBM50118789
NameBDBM50118789
Synonyms:2-(oxaloamino)benzoic acid | CHEMBL139050
TypeSmall organic molecule
Emp. Form.C9H7NO5
Mol. Mass.209.1556
SMILESOC(=O)C(=O)Nc1ccccc1C(O)=O