Reaction Details
TargetReceptor-type tyrosine-protein phosphatase beta
LigandBDBM50118762
Substrate/Competitorn/a
Meas. Tech.ChEMBL_590758 (CHEMBL1050900)
Ki 19000±n/a nM
Citation Vidovic, DSchürer, SC Knowledge-based characterization of similarity relationships in the human protein-tyrosine phosphatase family for rational inhibitor design. J Med Chem52:6649-59 (2009) 
 
Receptor-type tyrosine-protein phosphatase beta
Name:Receptor-type tyrosine-protein phosphatase beta
Type:Protein
Mol. Mass.:224324.80
Organism:Homo sapiens (Human)
Description:P23467
Residue:1997
BDBM50118762
NameBDBM50118762
Synonyms:2-(Oxalyl-amino)-4,5,6,7-tetrahydro-benzo[b]thiophene-3-carboxylic acid 2-oxalylamino-4,5,6,7-tetrahydrobenzo[b]thiophene-3-carboxylic acid | CHEMBL138152
TypeSmall organic molecule
Emp. Form.C11H11NO5S
Mol. Mass.269.274
SMILESOC(=O)C(=O)Nc1sc2CCCCc2c1C(O)=O