Reaction Details
TargetTyrosine-protein phosphatase non-receptor type 2
LigandBDBM14267
Substrate/Competitorn/a
Meas. Tech.ChEMBL_590754 (CHEMBL1050896)
Ki 140±n/a nM
Citation Vidovic, DSchürer, SC Knowledge-based characterization of similarity relationships in the human protein-tyrosine phosphatase family for rational inhibitor design. J Med Chem52:6649-59 (2009) 
 
Tyrosine-protein phosphatase non-receptor type 2
Name:Tyrosine-protein phosphatase non-receptor type 2
Type:Protein
Mol. Mass.:48481.80
Organism:Homo sapiens (Human)
Description:P17706
Residue:415
BDBM14267
NameBDBM14267
Synonyms:4-bromo-3-(carboxymethoxy)-5-[4-(2-formamidoacetic acid)phenyl]thiophene-2-carboxylic acid | Monocyclic thiophene analog 36
TypeSmall organic molecule
Emp. Form.C16H12BrNO8S
Mol. Mass.458.237
SMILESOC(=O)COc1c(Br)c(sc1C(O)=O)-c1ccc(NC(=O)CC(O)=O)cc1