Reaction Details
TargetReceptor-type tyrosine-protein phosphatase F
LigandBDBM50118792
Substrate/Competitorn/a
Meas. Tech.ChEMBL_590756 (CHEMBL1050898)
Ki>2000000±n/a nM
Citation Vidovic, DSchürer, SC Knowledge-based characterization of similarity relationships in the human protein-tyrosine phosphatase family for rational inhibitor design. J Med Chem52:6649-59 (2009) 
 
Receptor-type tyrosine-protein phosphatase F
Name:Receptor-type tyrosine-protein phosphatase F
Type:Protein
Mol. Mass.:212869.85
Organism:Homo sapiens (Human)
Description:P10586
Residue:1907
BDBM50118792
NameBDBM50118792
Synonyms:2-(OXALYL-AMINO)-4,5,6,7-TETRAHYDRO-THIENO[2,3-C]PYRIDINE-3-CARBOXYLIC ACID CHEMBL139393
TypeSmall organic molecule
Emp. Form.C10H10N2O5S
Mol. Mass.270.262
SMILESOC(=O)C(=O)Nc1sc2CNCCc2c1C(O)=O