Reaction Details
TargetReceptor-type tyrosine-protein phosphatase epsilon
LigandBDBM50299461
Substrate/Competitorn/a
Meas. Tech.ChEMBL_590759 (CHEMBL1050901)
Ki>500000±n/a nM
Citation Vidovic, DSchürer, SC Knowledge-based characterization of similarity relationships in the human protein-tyrosine phosphatase family for rational inhibitor design. J Med Chem52:6649-59 (2009) 
 
Receptor-type tyrosine-protein phosphatase epsilon
Name:Receptor-type tyrosine-protein phosphatase epsilon
Type:Protein
Mol. Mass.:80646.31
Organism:Homo sapiens (Human)
Description:P23469
Residue:700
BDBM50299461
NameBDBM50299461
Synonyms:(S)-7-(1,1-Dioxo-1H-1lambda*6*-benzo[d]isothiazol-3-yloxymethyl)-2-(oxalyl-amino)-4,7-dihydro-5H-thieno[2,3-c]pyran-3-carboxylic acid CHEMBL577144
TypeSmall organic molecule
Emp. Form.C18H14N2O9S2
Mol. Mass.466.442
SMILESOC(=O)C(=O)Nc1sc2[C@H](COC3=NS(=O)(=O)c4ccccc34)OCCc2c1C(O)=O