Reaction Details
TargetReceptor-type tyrosine-protein phosphatase epsilon
LigandBDBM50118789
Substrate/Competitorn/a
Meas. Tech.ChEMBL_590759 (CHEMBL1050901)
Ki 130000±n/a nM
Citation Vidovic, DSchürer, SC Knowledge-based characterization of similarity relationships in the human protein-tyrosine phosphatase family for rational inhibitor design. J Med Chem52:6649-59 (2009) 
 
Receptor-type tyrosine-protein phosphatase epsilon
Name:Receptor-type tyrosine-protein phosphatase epsilon
Type:Protein
Mol. Mass.:80646.31
Organism:Homo sapiens (Human)
Description:P23469
Residue:700
BDBM50118789
NameBDBM50118789
Synonyms:2-(oxaloamino)benzoic acid | CHEMBL139050
TypeSmall organic molecule
Emp. Form.C9H7NO5
Mol. Mass.209.1556
SMILESOC(=O)C(=O)Nc1ccccc1C(O)=O