Reaction Details
TargetReceptor-type tyrosine-protein phosphatase F
LigandBDBM50118762
Substrate/Competitorn/a
Meas. Tech.ChEMBL_590756 (CHEMBL1050898)
Ki 410000±n/a nM
Citation Vidovic, DSchürer, SC Knowledge-based characterization of similarity relationships in the human protein-tyrosine phosphatase family for rational inhibitor design. J Med Chem52:6649-59 (2009) 
 
Receptor-type tyrosine-protein phosphatase F
Name:Receptor-type tyrosine-protein phosphatase F
Type:Protein
Mol. Mass.:212869.85
Organism:Homo sapiens (Human)
Description:P10586
Residue:1907
BDBM50118762
NameBDBM50118762
Synonyms:2-(Oxalyl-amino)-4,5,6,7-tetrahydro-benzo[b]thiophene-3-carboxylic acid 2-oxalylamino-4,5,6,7-tetrahydrobenzo[b]thiophene-3-carboxylic acid | CHEMBL138152
TypeSmall organic molecule
Emp. Form.C11H11NO5S
Mol. Mass.269.274
SMILESOC(=O)C(=O)Nc1sc2CCCCc2c1C(O)=O