Reaction Details
TargetReceptor-type tyrosine-protein phosphatase alpha
LigandBDBM50118796
Substrate/Competitorn/a
Meas. Tech.ChEMBL_590760 (CHEMBL1037598)
Ki 800000±n/a nM
Citation Vidovic, DSchürer, SC Knowledge-based characterization of similarity relationships in the human protein-tyrosine phosphatase family for rational inhibitor design. J Med Chem52:6649-59 (2009) 
 
Receptor-type tyrosine-protein phosphatase alpha
Name:Receptor-type tyrosine-protein phosphatase alpha
Type:Enzyme
Mol. Mass.:90719.02
Organism:Homo sapiens (Human)
Description:P18433
Residue:802
BDBM50118796
NameBDBM50118796
Synonyms:6-(OXALYL-AMINO)-1H-INDOLE-5-CARBOXYLIC ACID CHEMBL342478
TypeSmall organic molecule
Emp. Form.C11H8N2O5
Mol. Mass.248.1916
SMILESOC(=O)C(=O)Nc1cc2[nH]ccc2cc1C(O)=O