Reaction Details
TargetNeuromedin-K receptor
LigandBDBM50299467
Substrate/Competitorn/a
Meas. Tech.ChEMBL_590792 (CHEMBL1037630)
Ki 0.3±n/a nM
Citation Malherbe, PKratzeisen, CMarcuz, AZenner, MTNettekoven, MHRatni, HWettstein, JGBissantz, C Identification of a critical residue in the transmembrane domain 2 of tachykinin neurokinin 3 receptor affecting the dissociation kinetics and antagonism mode of osanetant (SR 142801) and piperidine-based structures. J Med Chem52:7103-12 (2009) 
 
Neuromedin-K receptor
Name:Neuromedin-K receptor
Type:Enzyme
Mol. Mass.:52221.96
Organism:Homo sapiens (Human)
Description:P29371
Residue:465
BDBM50299467
NameBDBM50299467
Synonyms:(5S,8S,14S,17S,20S,23S,26S,29S,32S)-26-((1H-imidazol-5-yl)methyl)-32-amino-14,17,20-tribenzyl-5-carbamoyl-23-(carboxymethyl)-8-isobutyl-15-methyl-29-(2-(methylthio)ethyl)-7,10,13,16,19,22,25,28,31-nonaoxo-2-thia-6,9,12,15,18,21,24,27,30-nonaazatetratriacontan-34-oic acid | CHEMBL583102
TypeSmall organic molecule
Emp. Form.C60H81N13O14S2
Mol. Mass.1272.494
SMILESCSCC[C@H](NC(=O)[C@H](CC(C)C)NC(=O)CNC(=O)[C@H](Cc1ccccc1)N(C)C(=O)[C@H](Cc1ccccc1)NC(=O)[C@H](Cc1ccccc1)NC(=O)[C@H](CC(O)=O)NC(=O)[C@H](Cc1cnc[nH]1)NC(=O)[C@H](CCSC)NC(=O)[C@@H](N)CC(O)=O)C(N)=O