Reaction Details
TargetNeuromedin-K receptor
LigandBDBM50051293
Substrate/Competitorn/a
Meas. Tech.ChEMBL_590801 (CHEMBL1037639)
Ki 3±n/a nM
Citation Malherbe, PKratzeisen, CMarcuz, AZenner, MTNettekoven, MHRatni, HWettstein, JGBissantz, C Identification of a critical residue in the transmembrane domain 2 of tachykinin neurokinin 3 receptor affecting the dissociation kinetics and antagonism mode of osanetant (SR 142801) and piperidine-based structures. J Med Chem52:7103-12 (2009) 
 
Neuromedin-K receptor
Name:Neuromedin-K receptor
Type:Enzyme
Mol. Mass.:52221.96
Organism:Homo sapiens (Human)
Description:P29371
Residue:465
BDBM50051293
NameBDBM50051293
Synonyms:(S)-(-)-N-(R-ethylbenzyl)-3-hydroxy-2-phenylquinoline-4-carboxamide 3-Hydroxy-2-phenyl-quinoline-4-carboxylic acid (1-phenyl-propyl)-amide SB 223412 SB-223412 | Talnetant
TypeSmall organic molecule
Emp. Form.C25H22N2O2
Mol. Mass.382.4544
SMILESCC[C@H](NC(=O)c1c(O)c(nc2ccccc12)-c1ccccc1)c1ccccc1