Reaction Details
TargetLIM domain kinase 2
LigandBDBM50299593
Substrate/Competitorn/a
Meas. Tech.ChEMBL_592392 (CHEMBL1036965)
IC50 64±n/a nM
Citation Harrison, BAWhitlock, NAVoronkov, MVAlmstead, ZYGu, KJMabon, RGardyan, MHamman, BDAllen, JGopinathan, SMcKnight, BCrist, MZhang, YLiu, YCourtney, LFKey, BZhou, JPatel, NYates, PWLiu, QWilson, AGKimball, SDCrosson, CERice, DSRawlins, DB Novel class of LIM-kinase 2 inhibitors for the treatment of ocular hypertension and associated glaucoma. J Med Chem52:6515-8 (2009) 
 
LIM domain kinase 2
Name:LIM domain kinase 2
Type:PROTEIN
Mol. Mass.:72238.81
Organism:Homo sapiens (Human)
Description:ChEMBL_1514398
Residue:638
BDBM50299593
NameBDBM50299593
Synonyms:1-(5-methyl-7H-pyrrolo[2,3-d]pyrimidin-4-yl)-N-(3-phenoxyphenyl)piperidine-4-carboxamide | CHEMBL570109
TypeSmall organic molecule
Emp. Form.C25H25N5O2
Mol. Mass.427.4983
SMILESCc1c[nH]c2ncnc(N3CCC(CC3)C(=O)Nc3cccc(Oc4ccccc4)c3)c12