Reaction Details
TargetLIM domain kinase 2
LigandBDBM50299618
Substrate/Competitorn/a
Meas. Tech.ChEMBL_592392 (CHEMBL1036965)
IC50 5.5±n/a nM
Citation Harrison, BAWhitlock, NAVoronkov, MVAlmstead, ZYGu, KJMabon, RGardyan, MHamman, BDAllen, JGopinathan, SMcKnight, BCrist, MZhang, YLiu, YCourtney, LFKey, BZhou, JPatel, NYates, PWLiu, QWilson, AGKimball, SDCrosson, CERice, DSRawlins, DB Novel class of LIM-kinase 2 inhibitors for the treatment of ocular hypertension and associated glaucoma. J Med Chem52:6515-8 (2009) 
 
LIM domain kinase 2
Name:LIM domain kinase 2
Type:PROTEIN
Mol. Mass.:72238.81
Organism:Homo sapiens (Human)
Description:ChEMBL_1514398
Residue:638
BDBM50299618
NameBDBM50299618
Synonyms:(S)-N-(3-(isopropylcarbamoyl)phenyl)-2-methyl-4-(5-methyl-7H-pyrrolo[2,3-d]pyrimidin-4-yl)piperazine-1-carboxamide | CHEMBL572170
TypeSmall organic molecule
Emp. Form.C23H29N7O2
Mol. Mass.435.5221
SMILESCC(C)NC(=O)c1cccc(NC(=O)N2CCN(C[C@@H]2C)c2ncnc3[nH]cc(C)c23)c1