Reaction Details
TargetExtracellular calcium-sensing receptor
LigandBDBM50299671
Substrate/Competitorn/a
Meas. Tech.ChEMBL_592454 (CHEMBL1039645)
EC50>5000±n/a nM
Citation Poon, SFSt Jean, DJHarrington, PEHenley, CDavis, JMorony, SLott, FDReagan, JDLu, JYYang, YFotsch, C Discovery and optimization of substituted 1-(1-phenyl-1H-pyrazol-3-yl)methanamines as potent and efficacious type II calcimimetics. J Med Chem52:6535-8 (2009) 
 
Extracellular calcium-sensing receptor
Name:Extracellular calcium-sensing receptor
Type:Protein
Mol. Mass.:120663.13
Organism:Homo sapiens (Human)
Description:P41180
Residue:1078
BDBM50299671
NameBDBM50299671
Synonyms:(R)-N-((1-methyl-4-phenyl-1H-imidazol-2-yl)methyl)-1-phenylethanamine | CHEMBL568946
TypeSmall organic molecule
Emp. Form.C18H19N3
Mol. Mass.277.3636
SMILESC[C@@H](NCc1nc(c[nH]1)-c1ccccc1)c1ccccc1