Reaction Details
TargetExtracellular calcium-sensing receptor
LigandBDBM50299678
Substrate/Competitorn/a
Meas. Tech.ChEMBL_592454 (CHEMBL1039645)
EC50 2340±n/a nM
Citation Poon, SFSt Jean, DJHarrington, PEHenley, CDavis, JMorony, SLott, FDReagan, JDLu, JYYang, YFotsch, C Discovery and optimization of substituted 1-(1-phenyl-1H-pyrazol-3-yl)methanamines as potent and efficacious type II calcimimetics. J Med Chem52:6535-8 (2009) 
 
Extracellular calcium-sensing receptor
Name:Extracellular calcium-sensing receptor
Type:Protein
Mol. Mass.:120663.13
Organism:Homo sapiens (Human)
Description:P41180
Residue:1078
BDBM50299678
NameBDBM50299678
Synonyms:(1R)-2-methyl-N-((1R)-1-phenylethyl)-1-(1-(4-(trifluoromethyl)phenyl)-1H-pyrazol-3-yl)-1-propanamine | CHEMBL572362
TypeSmall organic molecule
Emp. Form.C22H24F3N3
Mol. Mass.387.4413
SMILESCC(C)[C@@H](N[C@H](C)c1ccccc1)c1ccn(n1)-c1ccc(cc1)C(F)(F)F