Reaction Details
TargetExtracellular calcium-sensing receptor
LigandBDBM50299680
Substrate/Competitorn/a
Meas. Tech.ChEMBL_592454 (CHEMBL1039645)
EC50 92±n/a nM
Citation Poon, SFSt Jean, DJHarrington, PEHenley, CDavis, JMorony, SLott, FDReagan, JDLu, JYYang, YFotsch, C Discovery and optimization of substituted 1-(1-phenyl-1H-pyrazol-3-yl)methanamines as potent and efficacious type II calcimimetics. J Med Chem52:6535-8 (2009) 
 
Extracellular calcium-sensing receptor
Name:Extracellular calcium-sensing receptor
Type:Protein
Mol. Mass.:120663.13
Organism:Homo sapiens (Human)
Description:P41180
Residue:1078
BDBM50299680
NameBDBM50299680
Synonyms:(1R)-1-(3-chlorophenyl)-N-((1-(4-(trifluoromethyl)phenyl)-1H-pyrazol-3-yl)methyl)ethanamine | CHEMBL568485
TypeSmall organic molecule
Emp. Form.C20H19ClF3N3
Mol. Mass.393.833
SMILESC[C@@H](N[C@H](C)c1cccc(Cl)c1)c1ccn(n1)-c1ccc(cc1)C(F)(F)F