Reaction Details
TargetExtracellular calcium-sensing receptor
LigandBDBM50299685
Substrate/Competitorn/a
Meas. Tech.ChEMBL_592454 (CHEMBL1039645)
EC50 1920±n/a nM
Citation Poon, SFSt Jean, DJHarrington, PEHenley, CDavis, JMorony, SLott, FDReagan, JDLu, JYYang, YFotsch, C Discovery and optimization of substituted 1-(1-phenyl-1H-pyrazol-3-yl)methanamines as potent and efficacious type II calcimimetics. J Med Chem52:6535-8 (2009) 
 
Extracellular calcium-sensing receptor
Name:Extracellular calcium-sensing receptor
Type:Protein
Mol. Mass.:120663.13
Organism:Homo sapiens (Human)
Description:P41180
Residue:1078
BDBM50299685
NameBDBM50299685
Synonyms:4-(3-((R)-1-((R)-1-(3-chlorophenyl)ethylamino)ethyl)-5-methoxy-1H-pyrazol-1-yl)benzoic acid | CHEMBL583469
TypeSmall organic molecule
Emp. Form.C21H22ClN3O3
Mol. Mass.399.871
SMILESCOc1cc(nn1-c1ccc(cc1)C(O)=O)[C@@H](C)N[C@H](C)c1cccc(Cl)c1