Reaction Details
TargetMu-type opioid receptor
LigandBDBM50299727
Substrate/Competitorn/a
Meas. Tech.ChEMBL_588896 (CHEMBL1061220)
Ki 0.970000±n/a nM
Citation Nieland, NPRennison, DBroadbear, JHPurington, LWoods, JHTraynor, JRLewis, JWHusbands, SM 14beta-Arylpropiolylamino-17-cyclopropylmethyl-7,8-dihydronormorphinones and related opioids. Further examples of pseudoirreversible mu opioid receptor antagonists. J Med Chem52:6926-30 (2009) 
 
Mu-type opioid receptor
Name:Mu-type opioid receptor
Type:G Protein-Coupled Receptor (GPCR)
Mol. Mass.:44789.51
Organism:Homo sapiens (Human)
Description:P35372
Residue:400
BDBM50299727
NameBDBM50299727
Synonyms:CHEMBL574175 | N-Cyclopropylmethyl-14beta-[3'-(4''-chlorophenyl)-propargylamino]-7,8-dihydronormorphinone
TypeSmall organic molecule
Emp. Form.C29H29ClN2O3
Mol. Mass.489.005
SMILESOc1ccc2C[C@H]3N(CC4CC4)CC[C@@]45[C@@H](Oc1c24)C(=O)CC[C@@]35NCC#Cc1ccc(Cl)cc1