Reaction Details
TargetMu-type opioid receptor
LigandBDBM50299728
Substrate/Competitorn/a
Meas. Tech.ChEMBL_588896 (CHEMBL1061220)
Ki 1.3±n/a nM
Citation Nieland, NPRennison, DBroadbear, JHPurington, LWoods, JHTraynor, JRLewis, JWHusbands, SM 14beta-Arylpropiolylamino-17-cyclopropylmethyl-7,8-dihydronormorphinones and related opioids. Further examples of pseudoirreversible mu opioid receptor antagonists. J Med Chem52:6926-30 (2009) 
 
Mu-type opioid receptor
Name:Mu-type opioid receptor
Type:G Protein-Coupled Receptor (GPCR)
Mol. Mass.:44789.51
Organism:Homo sapiens (Human)
Description:P35372
Residue:400
BDBM50299728
NameBDBM50299728
Synonyms:CHEMBL575682 | N-Cyclopropylmethyl-14beta-[phenylpropioloylamino]-7,8-dihydronormorphinone
TypeSmall organic molecule
Emp. Form.C29H28N2O4
Mol. Mass.468.5436
SMILESOc1ccc2C[C@H]3N(CC4CC4)CC[C@@]45[C@@H](Oc1c24)C(=O)CC[C@@]35NC(=O)C#Cc1ccccc1