Reaction Details
TargetKappa-type opioid receptor
LigandBDBM50195674
Substrate/Competitorn/a
Meas. Tech.ChEMBL_588898 (CHEMBL1061222)
Ki 16±n/a nM
Citation Nieland, NPRennison, DBroadbear, JHPurington, LWoods, JHTraynor, JRLewis, JWHusbands, SM 14beta-Arylpropiolylamino-17-cyclopropylmethyl-7,8-dihydronormorphinones and related opioids. Further examples of pseudoirreversible mu opioid receptor antagonists. J Med Chem52:6926-30 (2009) 
 
Kappa-type opioid receptor
Name:Kappa-type opioid receptor
Type:G Protein-Coupled Receptor (GPCR)
Mol. Mass.:42648.76
Organism:Homo sapiens (Human)
Description:P41145
Residue:380
BDBM50195674
NameBDBM50195674
Synonyms:1N-[4-cyclopropylmethyl-10-methoxy-14-oxo-(17S)-12-oxa-4-azapentacyclo[9.6.1.01,13.05,17.07,18]octadeca-7,9,11(18)-trien-17-yl]-3-(4-chlorophenyl)-(E)-2-propenamide(Methyoclocinnamox (MC-CAM)) MC-CAM
TypeSmall organic molecule
Emp. Form.C30H31ClN2O4
Mol. Mass.519.031
SMILESCOc1ccc2C[C@H]3N(CC4CC4)CC[C@@]45[C@@H](Oc1c24)C(=O)CC[C@@]35NC(=O)\C=C\c1ccc(Cl)cc1