Reaction Details
TargetSodium-dependent serotonin transporter
LigandBDBM50299789
Substrate/Competitorn/a
Meas. Tech.ChEMBL_589385 (CHEMBL1047380)
Ki 2±n/a nM
Citation Gray, DLXu, WCampbell, BMDounay, ABBarta, NBoroski, SDenny, LEvans, LStratman, NProbert, A Discovery and pharmacological characterization of aryl piperazine and piperidine ethers as dual acting norepinephrine reuptake inhibitors and 5-HT1A partial agonists. Bioorg Med Chem Lett19:6604-7 (2009) 
 
Sodium-dependent serotonin transporter
Name:Sodium-dependent serotonin transporter
Type:Multi-pass membrane protein
Mol. Mass.:70322.51
Organism:Homo sapiens (Human)
Description:P31645
Residue:630
BDBM50299789
NameBDBM50299789
Synonyms:4-(5-fluoro-2-(4-fluorobenzyloxy)phenyl)piperidine | CHEMBL574008
TypeSmall organic molecule
Emp. Form.C18H19F2NO
Mol. Mass.303.3464
SMILESFc1ccc(COc2ccc(F)cc2C2CCNCC2)cc1