Reaction Details
TargetSodium-dependent noradrenaline transporter
LigandBDBM50299795
Substrate/Competitorn/a
Meas. Tech.ChEMBL_589383 (CHEMBL1047378)
Ki 9±n/a nM
Citation Gray, DLXu, WCampbell, BMDounay, ABBarta, NBoroski, SDenny, LEvans, LStratman, NProbert, A Discovery and pharmacological characterization of aryl piperazine and piperidine ethers as dual acting norepinephrine reuptake inhibitors and 5-HT1A partial agonists. Bioorg Med Chem Lett19:6604-7 (2009) 
 
Sodium-dependent noradrenaline transporter
Name:Sodium-dependent noradrenaline transporter
Type:Multi-pass membrane protein
Mol. Mass.:69337.72
Organism:Homo sapiens (Human)
Description:P23975
Residue:617
BDBM50299795
NameBDBM50299795
Synonyms:4-(2-(benzyloxy)-6-fluorophenyl)piperidine | CHEMBL575930
TypeSmall organic molecule
Emp. Form.C18H20FNO
Mol. Mass.285.3559
SMILESFc1cccc(OCc2ccccc2)c1C1CCNCC1