Reaction Details
Target5-hydroxytryptamine receptor 1A
LigandBDBM50299788
Substrate/Competitorn/a
Meas. Tech.ChEMBL_589382 (CHEMBL1047377)
Ki 11±n/a nM
Citation Gray, DLXu, WCampbell, BMDounay, ABBarta, NBoroski, SDenny, LEvans, LStratman, NProbert, A Discovery and pharmacological characterization of aryl piperazine and piperidine ethers as dual acting norepinephrine reuptake inhibitors and 5-HT1A partial agonists. Bioorg Med Chem Lett19:6604-7 (2009) 
 
5-hydroxytryptamine receptor 1A
Name:5-hydroxytryptamine receptor 1A
Type:n/a
Mol. Mass.:46122.49
Organism:Homo sapiens (Human)
Description:n/a
Residue:422
BDBM50299788
NameBDBM50299788
Synonyms:4-(2-(3-fluorophenoxy)phenyl)piperidine | CHEMBL583752
TypeSmall organic molecule
Emp. Form.C17H18FNO
Mol. Mass.271.3293
SMILESFc1cccc(Oc2ccccc2C2CCNCC2)c1