Reaction Details
TargetCellular tumor antigen p53
LigandBDBM50299818
Substrate/Competitorn/a
Meas. Tech.ChEMBL_589609 (CHEMBL1052162)
IC50 11400±n/a nM
Citation Allen, JGBourbeau, MPWohlhieter, GEBartberger, MDMichelsen, KHungate, RGadwood, RCGaston, RDEvans, BMann, LWMatison, MESchneider, SHuang, XYu, DAndrews, PSReichelt, ALong, AMYakowec, PYang, EYLee, TAOliner, JD Discovery and optimization of chromenotriazolopyrimidines as potent inhibitors of the mouse double minute 2-tumor protein 53 protein-protein interaction. J Med Chem52:7044-53 (2009) 
 
Cellular tumor antigen p53
Name:Cellular tumor antigen p53
Type:fusion protein
Mol. Mass.:43654.73
Organism:Homo sapiens (Human)
Description:The full-length His6-wt-p53 expressed in E. coli was used in assays.
Residue:393
BDBM50299818
NameBDBM50299818
Synonyms:(+/-)-syn-6,7-Bis(4-bromophenyl)-3-fluoro-2,12-dimethyl-7,12-dihydro-6H-chromeno[4,3-d][1,2,4]triazolo[1,5-a]pyrimidine | CHEMBL584512
TypeSmall organic molecule
Emp. Form.C26H19Br2FN4O
Mol. Mass.582.262
SMILESCN1c2ncnn2C(C2=C1c1cc(C)c(F)cc1OC2c1ccc(Br)cc1)c1ccc(Br)cc1