Reaction Details
TargetGlutaminyl-peptide cyclotransferase
LigandBDBM50299853
Substrate/Competitorn/a
Meas. Tech.ChEMBL_589681 (CHEMBL1057686)
Ki 6.3±n/a nM
Citation Buchholz, MHamann, AAust, SBrandt, WBöhme, LHoffmann, TSchilling, SDemuth, HUHeiser, U Inhibitors for human glutaminyl cyclase by structure based design and bioisosteric replacement. J Med Chem52:7069-80 (2009) 
 
Glutaminyl-peptide cyclotransferase
Name:Glutaminyl-peptide cyclotransferase
Type:Enzyme
Mol. Mass.:40877.05
Organism:Homo sapiens (Human)
Description:Q16769
Residue:361
BDBM50299853
NameBDBM50299853
Synonyms:1-(3,4-Dimethoxyphenyl)-3-(3-(5-methyl-1H-imidazol-1-yl)propyl)thiourea US9656991, 1
TypeSmall organic molecule
Emp. Form.C16H22N4O2S
Mol. Mass.334.436
SMILESCOc1ccc(NC(=S)NCCCn2cncc2C)cc1OC