Reaction Details
TargetCyclin-dependent kinase 5 activator 1
LigandBDBM50414898
Substrate/Competitorn/a
Meas. Tech.ChEMBL_590314 (CHEMBL1054437)
IC50 14±n/a nM
Citation Kaller, MRZhong, WHenley, CMagal, ENguyen, TPowers, DRzasa, RMWang, WXiong, XNorman, MH Design and synthesis of 6-oxo-1,6-dihydropyridines as CDK5 inhibitors. Bioorg Med Chem Lett19:6591-4 (2009) 
 
Cyclin-dependent kinase 5 activator 1
Name:Cyclin-dependent kinase 5 activator 1
Type:Protein Complex
Mol. Mass.:n/a
Description:n/a
Components:This complex has 2 components.
Component 1
Name:Cyclin-dependent kinase 5
Synonyms:CDK5 CDKN5 Cyclin-dependent kinase 5 (CDK5/ p25) Cyclin-dependent-like kinase 5 PSSALRE Tau protein kinase II catalytic subunit
Type:Enzyme Subunit
Mol. Mass.:33308.61
Organism:Homo sapiens (Human)
Description:n/a
Residue:292
Component 2
Name:Cyclin-dependent kinase 5 activator 1
Synonyms:CD5R1_HUMAN CDK5R1 Cyclin-dependent kinase 5 (CDK5/p25) NCK5A p35
Type:Enzyme Subunit
Mol. Mass.:34077.43
Organism:Homo sapiens (Human)
Description:Q15078
Residue:307
BDBM50414898
NameBDBM50414898
Synonyms:CHEMBL584268
TypeSmall organic molecule
Emp. Form.C21H24N4O3S
Mol. Mass.412.505
SMILESCCOC(=O)c1cc(-c2csc(n2)-c2ccnc(NCC(C)C)c2)c(=O)[nH]c1C