Reaction Details
TargetBeta-2 adrenergic receptor
LigandBDBM50299890
Substrate/Competitorn/a
Meas. Tech.ChEMBL_590086 (CHEMBL1044765)
EC50 0.100000±n/a nM
Citation Hoenke, CBouyssou, TTautermann, CSRudolf, KSchnapp, AKonetzki, I Use of 5-hydroxy-4H-benzo[1,4]oxazin-3-ones as beta2-adrenoceptor agonists. Bioorg Med Chem Lett19:6640-4 (2009) 
 
Beta-2 adrenergic receptor
Name:Beta-2 adrenergic receptor
Type:n/a
Mol. Mass.:46461.69
Organism:Homo sapiens (Human)
Description:P07550
Residue:413
BDBM50299890
NameBDBM50299890
Synonyms:5-hydroxy-8-(1-hydroxy-2-(1-(4-hydroxyphenyl)-2-methylpropan-2-ylamino)ethyl)-2H-benzo[b][1,4]oxazin-3(4H)-one | CHEMBL568272
TypeSmall organic molecule
Emp. Form.C20H24N2O5
Mol. Mass.372.415
SMILESCC(C)(Cc1ccc(O)cc1)NCC(O)c1ccc(O)c2NC(=O)COc12