Reaction Details
TargetBeta-1 adrenergic receptor
LigandBDBM50151720
Substrate/Competitorn/a
Meas. Tech.ChEMBL_590084 (CHEMBL1044763)
EC50 86±n/a nM
Citation Hoenke, CBouyssou, TTautermann, CSRudolf, KSchnapp, AKonetzki, I Use of 5-hydroxy-4H-benzo[1,4]oxazin-3-ones as beta2-adrenoceptor agonists. Bioorg Med Chem Lett19:6640-4 (2009) 
 
Beta-1 adrenergic receptor
Name:Beta-1 adrenergic receptor
Type:G Protein-Coupled Receptor (GPCR)
Mol. Mass.:51338.40
Organism:Homo sapiens (Human)
Description:P08588
Residue:477
BDBM50151720
NameBDBM50151720
Synonyms:ARFORMOTEROL TARTRATE CHEMBL605993 FORMOTEROL FUMARATE N-(2-Hydroxy-5-{1-hydroxy-2-[2-(4-methoxy-phenyl)-1-methyl-ethylamino]-ethyl}-phenyl)-formamide Symbicort | cid_9912089
TypeSmall organic molecule
Emp. Form.C19H24N2O4
Mol. Mass.344.4049
SMILESCOc1ccc(C[C@@H](C)NC[C@H](O)c2ccc(O)c(NC=O)c2)cc1