Reaction Details
TargetBeta-1 adrenergic receptor
LigandBDBM50299890
Substrate/Competitorn/a
Meas. Tech.ChEMBL_590084 (CHEMBL1044763)
EC50 0.900000±n/a nM
Citation Hoenke, CBouyssou, TTautermann, CSRudolf, KSchnapp, AKonetzki, I Use of 5-hydroxy-4H-benzo[1,4]oxazin-3-ones as beta2-adrenoceptor agonists. Bioorg Med Chem Lett19:6640-4 (2009) 
 
Beta-1 adrenergic receptor
Name:Beta-1 adrenergic receptor
Type:G Protein-Coupled Receptor (GPCR)
Mol. Mass.:51338.40
Organism:Homo sapiens (Human)
Description:P08588
Residue:477
BDBM50299890
NameBDBM50299890
Synonyms:5-hydroxy-8-(1-hydroxy-2-(1-(4-hydroxyphenyl)-2-methylpropan-2-ylamino)ethyl)-2H-benzo[b][1,4]oxazin-3(4H)-one | CHEMBL568272
TypeSmall organic molecule
Emp. Form.C20H24N2O5
Mol. Mass.372.415
SMILESCC(C)(Cc1ccc(O)cc1)NCC(O)c1ccc(O)c2NC(=O)COc12