Reaction Details
TargetPoly [ADP-ribose] polymerase 1
LigandBDBM50300006
Substrate/Competitorn/a
Meas. Tech.ChEMBL_593119 (CHEMBL1042277)
EC50 20±n/a nM
Citation Tong, YBouska, JJEllis, PAJohnson, EFLeverson, JLiu, XMarcotte, PAOlson, AMOsterling, DJPrzytulinska, MRodriguez, LEShi, YSoni, NStavropoulos, JThomas, SDonawho, CKFrost, DJLuo, YGiranda, VLPenning, TD Synthesis and evaluation of a new generation of orally efficacious benzimidazole-based poly(ADP-ribose) polymerase-1 (PARP-1) inhibitors as anticancer agents. J Med Chem52:6803-13 (2009) 
 
Poly [ADP-ribose] polymerase 1
Name:Poly [ADP-ribose] polymerase 1
Type:n/a
Mol. Mass.:113114.22
Organism:Homo sapiens (Human)
Description:P09874
Residue:1014
BDBM50300006
NameBDBM50300006
Synonyms:2-(4-(7-(Trifluoromethyl)imidazo[1,2-a]pyridin-2-yl)phenyl)-1Hbenzo[d]imidazole-4-carboxamide | CHEMBL569635
TypeSmall organic molecule
Emp. Form.C22H14F3N5O
Mol. Mass.421.3747
SMILESNC(=O)c1cccc2[nH]c(nc12)-c1ccc(cc1)-c1cn2ccc(cc2n1)C(F)(F)F