Reaction Details
TargetPoly [ADP-ribose] polymerase 1
LigandBDBM50300016
Substrate/Competitorn/a
Meas. Tech.ChEMBL_593119 (CHEMBL1042277)
EC50 7.8±n/a nM
Citation Tong, YBouska, JJEllis, PAJohnson, EFLeverson, JLiu, XMarcotte, PAOlson, AMOsterling, DJPrzytulinska, MRodriguez, LEShi, YSoni, NStavropoulos, JThomas, SDonawho, CKFrost, DJLuo, YGiranda, VLPenning, TD Synthesis and evaluation of a new generation of orally efficacious benzimidazole-based poly(ADP-ribose) polymerase-1 (PARP-1) inhibitors as anticancer agents. J Med Chem52:6803-13 (2009) 
 
Poly [ADP-ribose] polymerase 1
Name:Poly [ADP-ribose] polymerase 1
Type:n/a
Mol. Mass.:113114.22
Organism:Homo sapiens (Human)
Description:P09874
Residue:1014
BDBM50300016
NameBDBM50300016
Synonyms:2-(4-(Pyridin-2-yl)phenyl)-1H-benzo[d]imidazole-4-carboxamide CHEMBL576423
TypeSmall organic molecule
Emp. Form.C19H14N4O
Mol. Mass.314.3407
SMILESNC(=O)c1cccc2[nH]c(nc12)-c1ccc(cc1)-c1ccccn1