Reaction Details
TargetTyrosine-protein kinase ABL1
LigandBDBM50300027
Substrate/Competitorn/a
Meas. Tech.ChEMBL_593161 (CHEMBL1044075)
IC50<100.0±n/a nM
Citation Cha, MYLee, KOKim, JWLee, CGSong, JYKim, YHLee, GSPark, SBKim, MS Discovery of a novel Her-1/Her-2 dual tyrosine kinase inhibitor for the treatment of Her-1 selective inhibitor-resistant non-small cell lung cancer. J Med Chem52:6880-8 (2009) 
 
Tyrosine-protein kinase ABL1
Name:Tyrosine-protein kinase ABL1
Type:Enzyme
Mol. Mass.:122897.30
Organism:Homo sapiens (Human)
Description:P00519
Residue:1130
BDBM50300027
NameBDBM50300027
Synonyms:(S)-1-Acryloyl-N-[4-(3-chloro-2,4-difluorophenylamino)-7-(2-methoxyethoxy)quinazolin-6-yl]pyrrolidine-2-carboxamide | CHEMBL569880
TypeSmall organic molecule
Emp. Form.C25H24ClF2N5O4
Mol. Mass.531.939
SMILESCOCCOc1cc2ncnc(Nc3ccc(F)c(Cl)c3F)c2cc1NC(=O)[C@@H]1CCCN1C(=O)C=C