Reaction Details
TargetReceptor tyrosine-protein kinase erbB-4
LigandBDBM50300027
Substrate/Competitorn/a
Meas. Tech.ChEMBL_593146 (CHEMBL1044060)
IC50<100.0±n/a nM
Citation Cha, MYLee, KOKim, JWLee, CGSong, JYKim, YHLee, GSPark, SBKim, MS Discovery of a novel Her-1/Her-2 dual tyrosine kinase inhibitor for the treatment of Her-1 selective inhibitor-resistant non-small cell lung cancer. J Med Chem52:6880-8 (2009) 
 
Receptor tyrosine-protein kinase erbB-4
Name:Receptor tyrosine-protein kinase erbB-4
Type:Protein
Mol. Mass.:146803.56
Organism:Homo sapiens (Human)
Description:Q15303
Residue:1308
BDBM50300027
NameBDBM50300027
Synonyms:(S)-1-Acryloyl-N-[4-(3-chloro-2,4-difluorophenylamino)-7-(2-methoxyethoxy)quinazolin-6-yl]pyrrolidine-2-carboxamide | CHEMBL569880
TypeSmall organic molecule
Emp. Form.C25H24ClF2N5O4
Mol. Mass.531.939
SMILESCOCCOc1cc2ncnc(Nc3ccc(F)c(Cl)c3F)c2cc1NC(=O)[C@@H]1CCCN1C(=O)C=C