Reaction Details
TargetHistone-lysine N-methyltransferase EHMT2
LigandBDBM50300033
Substrate/Competitorn/a
Meas. Tech.ChEMBL_593233 (CHEMBL1046740)
IC50 6500±n/a nM
Citation Liu, FChen, XAllali-Hassani, AQuinn, AMWasney, GADong, ABarsyte, DKozieradzki, ISenisterra, GChau, ISiarheyeva, AKireev, DBJadhav, AHerold, JMFrye, SVArrowsmith, CHBrown, PJSimeonov, AVedadi, MJin, J Discovery of a 2,4-diamino-7-aminoalkoxyquinazoline as a potent and selective inhibitor of histone lysine methyltransferase G9a. J Med Chem52:7950-3 (2009) 
 
Histone-lysine N-methyltransferase EHMT2
Name:Histone-lysine N-methyltransferase EHMT2
Type:Enzyme
Mol. Mass.:132339.87
Organism:Homo sapiens (Human)
Description:Q96KQ7
Residue:1210
BDBM50300033
NameBDBM50300033
Synonyms:CHEMBL585180 | N2,N2-diethyl-6,7-dimethoxy-N4-(1-methylpiperidin-4-yl)quinazoline-2,4-diamine
TypeSmall organic molecule
Emp. Form.C20H31N5O2
Mol. Mass.373.4924
SMILESCCN(CC)c1nc(NC2CCN(C)CC2)c2cc(OC)c(OC)cc2n1