Reaction Details
TargetDual specificity calcium/calmodulin-dependent 3',5'-cyclic nucleotide phosphodiesterase 1C
LigandBDBM50300111
Substrate/Competitorn/a
Meas. Tech.ChEMBL_593498 (CHEMBL1047622)
IC50 220±n/a nM
Citation Verhoest, PRProulx-Lafrance, CCorman, MChenard, LHelal, CJHou, XKleiman, RLiu, SMarr, EMenniti, FSSchmidt, CJVanase-Frawley, MSchmidt, AWWilliams, RDNelson, FRFonseca, KRLiras, S Identification of a brain penetrant PDE9A inhibitor utilizing prospective design and chemical enablement as a rapid lead optimization strategy. J Med Chem52:7946-9 (2009) 
 
Dual specificity calcium/calmodulin-dependent 3',5'-cyclic nucleotide phosphodiesterase 1C
Name:Dual specificity calcium/calmodulin-dependent 3',5'-cyclic nucleotide phosphodiesterase 1C
Type:Enzyme
Mol. Mass.:80778.58
Organism:Homo sapiens (Human)
Description:Q14123
Residue:709
BDBM50300111
NameBDBM50300111
Synonyms:CHEMBL566300 | trans-1-cyclopentyl-6-(1-(imidazo[1,2-a]pyridin-2-ylmethyl)-4-methylpyrrolidin-3-yl)-1H-pyrazolo[3,4-d]pyrimidin-4(5H)-one
TypeSmall organic molecule
Emp. Form.C23H27N7O
Mol. Mass.417.5068
SMILESC[C@@H]1CN(Cc2cn3ccccc3n2)C[C@H]1c1nc2n(ncc2c(=O)[nH]1)C1CCCC1