Reaction Details
TargetDual specificity calcium/calmodulin-dependent 3',5'-cyclic nucleotide phosphodiesterase 1C
LigandBDBM50300101
Substrate/Competitorn/a
Meas. Tech.ChEMBL_593498 (CHEMBL1047622)
IC50 2100±n/a nM
Citation Verhoest, PRProulx-Lafrance, CCorman, MChenard, LHelal, CJHou, XKleiman, RLiu, SMarr, EMenniti, FSSchmidt, CJVanase-Frawley, MSchmidt, AWWilliams, RDNelson, FRFonseca, KRLiras, S Identification of a brain penetrant PDE9A inhibitor utilizing prospective design and chemical enablement as a rapid lead optimization strategy. J Med Chem52:7946-9 (2009) 
 
Dual specificity calcium/calmodulin-dependent 3',5'-cyclic nucleotide phosphodiesterase 1C
Name:Dual specificity calcium/calmodulin-dependent 3',5'-cyclic nucleotide phosphodiesterase 1C
Type:Enzyme
Mol. Mass.:80778.58
Organism:Homo sapiens (Human)
Description:Q14123
Residue:709
BDBM50300101
NameBDBM50300101
Synonyms:6-[(3,4-trans)-1-benzyl-4-methylpyrrolidin-3-yl]-1-cyclopentyl-15-dihydro-4H-pyrazolo[34-d]pyrimidin-4-one CHEMBL572517
TypeSmall organic molecule
Emp. Form.C20H25N5O
Mol. Mass.351.4454
SMILESCC(C)n1ncc2c1nc([nH]c2=O)[C@@H]1CN(Cc2ccccc2)C[C@H]1C