Reaction Details
TargetDual specificity calcium/calmodulin-dependent 3',5'-cyclic nucleotide phosphodiesterase 1C
LigandBDBM50300113
Substrate/Competitorn/a
Meas. Tech.ChEMBL_593498 (CHEMBL1047622)
IC50 50±n/a nM
Citation Verhoest, PRProulx-Lafrance, CCorman, MChenard, LHelal, CJHou, XKleiman, RLiu, SMarr, EMenniti, FSSchmidt, CJVanase-Frawley, MSchmidt, AWWilliams, RDNelson, FRFonseca, KRLiras, S Identification of a brain penetrant PDE9A inhibitor utilizing prospective design and chemical enablement as a rapid lead optimization strategy. J Med Chem52:7946-9 (2009) 
 
Dual specificity calcium/calmodulin-dependent 3',5'-cyclic nucleotide phosphodiesterase 1C
Name:Dual specificity calcium/calmodulin-dependent 3',5'-cyclic nucleotide phosphodiesterase 1C
Type:Enzyme
Mol. Mass.:80778.58
Organism:Homo sapiens (Human)
Description:Q14123
Residue:709
BDBM50300113
NameBDBM50300113
Synonyms:1-cyclopentyl-6-[(3S,4S)-4-methyl-1-(quinoxalin-6-ylmethyl)pyrrolidin-3-yl]-1,5-dihydro-4H-pyrazolo[3,4-d]pyrimidin-4-one | CHEMBL583914
TypeSmall organic molecule
Emp. Form.C24H27N7O
Mol. Mass.429.5175
SMILESC[C@@H]1CN(Cc2ccc3nccnc3c2)C[C@H]1c1nc2n(ncc2c(=O)[nH]1)C1CCCC1