Reaction Details
TargetE3 ubiquitin-protein ligase Mdm2
LigandBDBM50300115
Substrate/Competitorn/a
Meas. Tech.ChEMBL_593610 (CHEMBL1039715)
Ki 0.8±n/a nM
Citation Yu, SQin, DShangary, SChen, JWang, GDing, KMcEachern, DQiu, SNikolovska-Coleska, ZMiller, RKang, SYang, DWang, S Potent and orally active small-molecule inhibitors of the MDM2-p53 interaction. J Med Chem52:7970-3 (2009) 
 
E3 ubiquitin-protein ligase Mdm2
Name:E3 ubiquitin-protein ligase Mdm2
Type:Oncoprotein
Mol. Mass.:55196.54
Organism:Homo sapiens (Human)
Description:Q00987
Residue:491
BDBM50300115
NameBDBM50300115
Synonyms:(2'R,3S,4'S,5'R)-6-chloro-4'-(3-chloro-2-fluorophenyl)-N-(2-(2-methoxyethoxy)ethyl)-2'-neopentyl-2-oxospiro[indoline-3,3'-pyrrolidine]-5'-carboxamide | CHEMBL575538
TypeSmall organic molecule
Emp. Form.C28H34Cl2FN3O4
Mol. Mass.566.492
SMILESCOCCOCCNC(=O)[C@@H]1N[C@H](CC(C)(C)C)[C@@]2([C@H]1c1cccc(Cl)c1F)C(=O)Nc1cc(Cl)ccc21