Reaction Details
TargetCorticotropin-releasing factor receptor 1
LigandBDBM50300148
Substrate/Competitorn/a
Meas. Tech.ChEMBL_593894 (CHEMBL1037787)
IC50 1.4±n/a nM
Citation Hartz, RAAhuja, VTZhuo, XMattson, RJDenhart, DJDeskus, JAVrudhula, VMPan, SDitta, JLShu, YZGrace, JELentz, KALelas, SLi, YWMolski, TFKrishnananthan, SWong, HQian-Cutrone, JSchartman, RDenton, RLodge, NJZaczek, RMacor, JEBronson, JJ A strategy to minimize reactive metabolite formation: discovery of (S)-4-(1-cyclopropyl-2-methoxyethyl)-6-[6-(difluoromethoxy)-2,5-dimethylpyridin-3-ylamino]-5-oxo-4,5-dihydropyrazine-2-carbonitrile as a potent, orally bioavailable corticotropin-releasing factor-1 receptor antagonist. J Med Chem52:7653-68 (2009) 
 
Corticotropin-releasing factor receptor 1
Name:Corticotropin-releasing factor receptor 1
Type:G Protein-Coupled Receptor (GPCR)
Mol. Mass.:47870.75
Organism:Rattus norvegicus (rat)
Description:Receptor binding assays were performed using rat cortex homogenate.
Residue:415
BDBM50300148
NameBDBM50300148
Synonyms:(R)-4-(1-Cyclopropyl-2-methoxyethyl)-6-[6-(difluoromethoxy)-2,5-dimethylpyridin-3-ylamino]-5-oxo-4,5-dihydropyrazine-2-carbonitrile | CHEMBL576589
TypeSmall organic molecule
Emp. Form.C18H18ClF2N5O3
Mol. Mass.425.817
SMILESCOC[C@@H](C1CC1)n1cc(Cl)nc(Nc2cc(C#N)c(OC(F)F)nc2C)c1=O