Reaction Details
TargetCorticotropin-releasing factor receptor 1
LigandBDBM50300149
Substrate/Competitorn/a
Meas. Tech.ChEMBL_593894 (CHEMBL1037787)
IC50 0.21±n/a nM
Citation Hartz, RAAhuja, VTZhuo, XMattson, RJDenhart, DJDeskus, JAVrudhula, VMPan, SDitta, JLShu, YZGrace, JELentz, KALelas, SLi, YWMolski, TFKrishnananthan, SWong, HQian-Cutrone, JSchartman, RDenton, RLodge, NJZaczek, RMacor, JEBronson, JJ A strategy to minimize reactive metabolite formation: discovery of (S)-4-(1-cyclopropyl-2-methoxyethyl)-6-[6-(difluoromethoxy)-2,5-dimethylpyridin-3-ylamino]-5-oxo-4,5-dihydropyrazine-2-carbonitrile as a potent, orally bioavailable corticotropin-releasing factor-1 receptor antagonist. J Med Chem52:7653-68 (2009) 
 
Corticotropin-releasing factor receptor 1
Name:Corticotropin-releasing factor receptor 1
Type:G Protein-Coupled Receptor (GPCR)
Mol. Mass.:47870.75
Organism:Rattus norvegicus (rat)
Description:Receptor binding assays were performed using rat cortex homogenate.
Residue:415
BDBM50300149
NameBDBM50300149
Synonyms:(R)-5-Chloro-1-(1-cyclopropylpropyl)-3-(6-(difluoromethoxy)-2,5-dimethylpyridin-3-ylamino)pyrazin-2(1H)-one | CHEMBL583153
TypeSmall organic molecule
Emp. Form.C18H21ClF2N4O2
Mol. Mass.398.835
SMILESCC[C@H](C1CC1)n1cc(Cl)nc(Nc2cc(C)c(OC(F)F)nc2C)c1=O