Reaction Details
TargetDNA polymerase alpha catalytic subunit
LigandBDBM50300195
Substrate/Competitorn/a
Meas. Tech.ChEMBL_592717 (CHEMBL1042388)
IC50>2E4±n/a nM
Citation Yin, ZChen, YLKondreddi, RRChan, WLWang, GNg, RHLim, JYLee, WYJeyaraj, DANiyomrattanakit, PWen, DChao, AGlickman, JFVoshol, HMueller, DSpanka, CDressler, SNilar, SVasudevan, SGShi, PYKeller, TH N-sulfonylanthranilic acid derivatives as allosteric inhibitors of dengue viral RNA-dependent RNA polymerase. J Med Chem52:7934-7 (2009) 
 
DNA polymerase alpha catalytic subunit
Name:DNA polymerase alpha catalytic subunit
Type:PROTEIN
Mol. Mass.:165895.25
Organism:Homo sapiens (Human)
Description:ChEMBL_1365493
Residue:1462
BDBM50300195
NameBDBM50300195
Synonyms:4-Fluoro-2-[3-(1-naphthalen-2-ylmethyl-1H-pyrazol-3-yl)-benzenesulfonylamino]-benzoic acid | CHEMBL566314
TypeSmall organic molecule
Emp. Form.C27H20FN3O4S
Mol. Mass.501.529
SMILESOC(=O)c1ccc(F)cc1NS(=O)(=O)c1cccc(c1)-c1cnn(Cc2ccc3ccccc3c2)c1