Reaction Details
TargetDNA polymerase beta
LigandBDBM50300194
Substrate/Competitorn/a
Meas. Tech.ChEMBL_592718 (CHEMBL1042389)
IC50>2E4±n/a nM
Citation Yin, ZChen, YLKondreddi, RRChan, WLWang, GNg, RHLim, JYLee, WYJeyaraj, DANiyomrattanakit, PWen, DChao, AGlickman, JFVoshol, HMueller, DSpanka, CDressler, SNilar, SVasudevan, SGShi, PYKeller, TH N-sulfonylanthranilic acid derivatives as allosteric inhibitors of dengue viral RNA-dependent RNA polymerase. J Med Chem52:7934-7 (2009) 
 
DNA polymerase beta
Name:DNA polymerase beta
Type:Protein
Mol. Mass.:38188.76
Organism:Homo sapiens (Human)
Description:n/a
Residue:335
BDBM50300194
NameBDBM50300194
Synonyms:2-[3-(1-Benzyl-1H-pyrazol-3-yl)-benzenesulfonylamino]-4-fluoro-benzoic acid | CHEMBL584918
TypeSmall organic molecule
Emp. Form.C23H18FN3O4S
Mol. Mass.451.47
SMILESOC(=O)c1ccc(F)cc1NS(=O)(=O)c1cccc(c1)-c1cnn(Cc2ccccc2)c1